لیزر برانگیخته‌پار
preferred label: excimer laser @en
type: Concept
related: برانگیخته‌پار

مولکول
preferred label: molecule @en
type: Concept
related: برانگیخته‌پار

برانگیخته‌پار
alternative label: اکسیمر
scope note: مولکولی دو اتمی که در سطحی بالاتر از حالت پایه قرار دارد.
related: لیزر برانگیخته‌پار
related: مولکول
preferred label: excimer @en
type: Concept