خطای سمتی
scope note: میزان انحراف محور شرقی‌ـ غربی تلسکـوپ نصف‌النـهاری از محور شرقی‌ـ غربی دایرۀ افق ناظر
broader: خطا
preferred label: azimuth error @en
type: Concept

خطا
preferred label: error @en
type: Concept
narrower: خطای سمتی