تخریب زیست‌محیطی
preferred label: environmental degradation @en
type: Concept
narrower: تخریب جنگل

تخریب جنگل
scope note: تباهی کمّی و کیفی جنگل براثر عوامل مخرب زنده و غیرزنده
broader: تخریب زیست‌محیطی
preferred label: forest degradation @en
type: Concept