پسماند (ضایعات)
preferred label: waste @en
type: Concept
narrower: پسماند الکترونیکی

پسماند الکترونیکی
alternative label: e-waste @en
alternative label: ای‌ ـ ‌‌پسماند
scope note: بقایای اجزا و دستگاه‌های الکترونیکی دورانداختنی
broader: پسماند (ضایعات)
preferred label: electronic waste @en
type: Concept