تردش خوردگی
scope note: کاهش شدید شکل‌پذیری فلز براثر حملۀ خوردگی که معمولاً به‌صورت خوردگی مرزدانه‌ای پدید می‌آید.
broader: تردش
preferred label: corrosion embrittlement @en
type: Concept

تردش
preferred label: embrittlement @en
type: Concept
narrower: تردش خوردگی