تردش لحیمی
scope note: کاهش خاصیت مکانیکی یک فلز یا آلیاژ به دلیل نفوذ موضعی فلز مذاب در اطراف مرزِ دانه‌ها براثر لحیم‌کاری
broader: تردش
preferred label: solder embrittlement @en
type: Concept

تردش
preferred label: embrittlement @en
type: Concept
narrower: تردش لحیمی