مزون
preferred label: meson @en
type: Concept
narrower: ذره شبه‌نرده‌ای

ذره شبه‌نرده‌ای
alternative label: مزون شبه‌نرده‌ای
scope note: ذره‌ای شبه‌پایدار با اسپین صفر و پاریتۀ (parity) فرد
broader: مزون
preferred label: pseudoscalar particle @en
type: Concept