کوارک پایین
scope note: ذره‌ای بنیادی با بار الکتریکی eو1/3ـ و مؤلفه ایزوسپین 1/2و اسپین 1/2 و عدد باریونی 1/3
related: کوارک شگفت
broader: کوارک
preferred label: down quark @en
type: Concept

کوارک شگفت
preferred label: strange quark @en
type: Concept
related: کوارک پایین

کوارک
preferred label: quark @en
type: Concept
narrower: کوارک پایین