پیوند شیمیایی
preferred label: bonds (chemical) @en
type: Concept
related: الکترون‌کشانی

پتانسیل یونش
preferred label: ionization potential @en
type: Concept
related: الکترون‌کشانی

الکترون‌کشانی
scope note: توانایی نسبی اتم در پیوند شیمیایی برای جذب الکترون‌های مشترک
related: پیوند شیمیایی
related: پتانسیل یونش
preferred label: electronegativity @en
type: Concept