گرفت
preferred label: eclipse @en
type: Concept
narrower: خسوف

خسوف
alternative label: ماه‌گرفتگی
scope note: پنهان شدن ماه در سایۀ زمین وقتی که زمین بین ماه و خورشید است که به سه صورت جزئی و کلی و نیم‌سایه‌ای رخ می‌دهد.
broader: گرفت
preferred label: lunar eclipse @en
type: Concept