گرفت
preferred label: eclipse @en
type: Concept
narrower: کسوف

خورشید
preferred label: Sun @en
type: Concept
related: کسوف

کسوف
alternative label: خورشیدگرفتگی
scope note: پنهان شدن خورشید در پشت ماه وقتی که ماه بین زمین و خورشید باشد و سایۀ ماه بر زمین بیفتد؛ این پدیده به‌صورت جزئی و کلی و حلقوی رخ می‌دهد.
related: خورشید
broader: گرفت
preferred label: solar eclipse @en
type: Concept