گردوخاک جوّ
scope note: ذرات ریز معلق در هوا در اندازه‌های 1 تا 100 میکرومتر
broader: گردوخاک
preferred label: atmospheric dust @en
type: Concept

گردوخاک
preferred label: dust @en
type: Concept
narrower: گردوخاک جوّ