فروپاشی
scope note: هرگونه تغییر خواص خودبه‌خودی یا تحریکی هسته که به آزادسازی ذره یا پرتوِ گاما منجر شود.
narrower: فروپاشی مصنوعی
narrower: فروپاشی آلفازا
preferred label: disintegration @en
type: Concept

فروپاشی مصنوعی
preferred label: artificial disintegration @en
type: Concept
broader: فروپاشی

فروپاشی آلفازا
preferred label: alpha disintegration @en
type: Concept
broader: فروپاشی