بلور انباشتی
scope note: بلور نمک حاصل از تبلور شورابه‌ها که در مرز بین هوا و آب تشکیل می‌شود.
broader: بلور
preferred label: cumulate crystal @en
type: Concept

بلور
preferred label: crystal @en
type: Concept
narrower: بلور انباشتی