بلور میکایی
scope note: بلوری مانند بلور برگی با ورقه‌های بسیار نازک‌تر مانند میکا
broader: بلور
preferred label: micaceous crystal @en
type: Concept

بلور
preferred label: crystal @en
type: Concept
narrower: بلور میکایی