cosmic ray shower
alternative label: showers, cosmic ray
scope note: آبشاری از ذرات ثانوی و فوتون‌ها که در هنگام ورود پرتوِ اولیۀ کیهانی به جوّ زمین، براثر برخورد با مولکول‌های هوا تولید می‌شود. @fa
related: geophysical aspect of cosmic ray
broader: cosmic ray
preferred label: بارش پرتو کیهانی @fa
type: Concept

geophysical aspect of cosmic ray
preferred label: جنبه زمین‌فیزیکی پرتو کیهانی @fa
type: Concept
related: cosmic ray shower

cosmic ray
preferred label: پرتو کیهانی @fa
type: Concept
narrower: cosmic ray shower