واپایشگر ابر
scope note: نقطه‌ای برای ورود کاربران و مدیران به اَبر که در آنجا از مدیران دربارۀ منابع پرس‌وجو می‌شود و تصمیماتی ترازبالا با زمان‌بندی‌های مشخص گرفته می‌شود و به اجرا درمی‌آید.
broader: واپایشگر
preferred label: cloud controller @en
type: Concept

واپایشگر
preferred label: controller @en
type: Concept
narrower: واپایشگر ابر