واپایشگر
preferred label: controller @en
type: Concept
narrower: تنظیم‌گر فشار دود

تنظیم‌گر فشار دود
scope note: افزاره‌ای برای افزایش پس‌فشار دود با هدف هدایت بهتر آن به سامانۀ برگشت دود
broader: واپایشگر
preferred label: exhaust pressure regulator @en
type: Concept