شالوده
preferred label: foundation @en
type: Concept
narrower: شالوده تخت

شالوده تخت
scope note: شالودۀ پیوسته‌ای که به‌صورت تاوه‌ای ضخیم از بتن مسلح ساخته می‌شود و کل بار ساختمان را به زمین منتقل می‌کند.
broader: شالوده
preferred label: mat foundation @en
type: Concept