ثابت
preferred label: constant @en
type: Concept
narrower: ثابت دی‌الکتریک

ثابت دی‌الکتریک
scope note: ملاکی برای اندازه‌گیری اثر محیط بر پتانسیل برهم‌کنش دو بار الکتریکی که ازطریق مقایسۀ ظرفیت یک خازن در مجاورت نمونه و نیز بدون آن به دست می‌آید.
broader: ثابت
preferred label: dielectric constant @en
type: Concept