ثابت
preferred label: constant @en
type: Concept
narrower: ضریب هندسی

ضریب هندسی
alternative label: ثابت هندسی
scope note: عاملی عددی که در نسبت ولتاژ اندازه‌گیری‌شده به جریان ضرب می‌شود تا مقاومت‌ویژۀ ظاهری به‌ دست آید.
broader: ثابت
preferred label: geometric factor @en
type: Concept