پایستگی انرژی
scope note: اصلی بنیادی که براساس آن انرژی نه پدید می‌آید و نه نابود می‌شود، بلکه از نوعی به نوع دیگر تبدیل می‌شود.
broader: قانون پایستگی
preferred label: conservation of energy @en
type: Concept

قانون پایستگی
preferred label: conservation law @en
type: Concept
narrower: پایستگی انرژی