قانون پایستگی
preferred label: conservation law @en
type: Concept
narrower: پایستگی جرم ـ انرژی

پایستگی جرم ـ انرژی
scope note: اصلی که بنا بر آن انرژی پدید نمی‌آید و نابود هم نمی‌شود و هر جسمی به اعتبار جِرم خود دارای مقداری انرژی است، معادل حاصل‌ضرب جِرم جسم در مجذور سرعت نور
broader: قانون پایستگی
preferred label: mass-energy conservation @en
type: Concept