ماشین‌تحریر
preferred label: typewriter @en
type: Concept
related: صفحه‌کلید

افزار برهم‌کنشی
preferred label: interactive device @en
type: Concept
narrower: صفحه‌کلید

صفحه‌کلید
alternative label: کلیدگان
scope note: مجموعه‌ای از کلیدهای نمایشگر حروف الفبا و نشانه‌های دیگر که بر روی یک صفحه قرار گرفته‌اند و به رایانه متصل می‌شوند و از آن برای ورود اطلاعات به رایانه استفاده می‌کنند.
related: ماشین‌تحریر
broader: افزار برهم‌کنشی
preferred label: keyboard @en
type: Concept