چاپگر
preferred label: printer @en
type: Concept
narrower: چاپگر اپتیکی

چاپگر اپتیکی
scope note: دستگاهی برای چاپ فیلم یا جلوه‌های ویژه با استفاده از ابزارهای نوری/ اپتیکی
broader: چاپگر
preferred label: optical printer @en
type: Concept