واسط مدیریت داده‌های ابر
alternative label: میانای مدیریت داده‌های ابر
scope note: نوعی میانای کارکردی که در برنامه‌های کاربردی برای ایجاد و بازیابی و روزآمد کردن و حذف عناصر داده‌ای در اَبر از آن استفاده می‌شود.
broader: واسط رایانه‌ای
preferred label: cloud data management interface @en
type: Concept

واسط رایانه‌ای
preferred label: computer interface @en
type: Concept
narrower: واسط مدیریت داده‌های ابر