واسط رایانه‌ای
preferred label: computer interface @en
type: Concept
narrower: واسط کارکردی

واسط کارکردی
alternative label: میانای کارکردی
scope note: میانایی که فقط یک روش انتزاعی دارد و معمولاً فقط یک عمل انجام می‌دهد.
broader: واسط رایانه‌ای
preferred label: functional interface @en
type: Concept