صاف‌سازی
scope note: در نگاشتار رایانه‌ای، صاف کردن خطوط دندانه‌دار و ناصاف بر روی نمایشگر
broader: نگاشتار رایانه‌ای
preferred label: antialiasing @en
type: Concept

نگاشتار رایانه‌ای
preferred label: computer graphics @en
type: Concept
narrower: صاف‌سازی