رده‌بندی
preferred label: classification @en
type: Concept
narrower: رده‌بندی داده‌ها

رده‌بندی داده‌ها
scope note: دسته‌بندی مجموعه‌ای از داده‌ها براساس ویژگی‌های آنها
broader: رده‌بندی
preferred label: data classification @en
type: Concept