غوطه‌ورسازی داغ
scope note: پوشش‌دهی یک ماده با غوطه‌ور ساختن آن در یک حمام فلز مذاب مانند روی یا قلع
related: پوشانش غوطه‌ور
broader: فن پوشانش
preferred label: hot dipping @en
type: Concept

پوشانش غوطه‌ور
preferred label: dip coating @en
type: Concept
related: غوطه‌ورسازی داغ

فن پوشانش
preferred label: coating technique @en
type: Concept
narrower: غوطه‌ورسازی داغ