تمیزکاری شعله‌ای
scope note: روشی در آماده‌سازی سطوح فلزات برای عملیات بعدی که در آن از شعله برای پوسته‌زدایی و رفع آلودگی‌ها استفاده می‌شود.
broader: تمیزکاری
preferred label: flame cleaning @en
type: Concept

تمیزکاری
preferred label: cleaning @en
type: Concept
narrower: تمیزکاری شعله‌ای