تمیزکاری آندی
scope note: نوعی تمیزکاری برق‌کافتی که در آن قطعۀ موردنظر آند واقع می‌شود
broader: تمیزکاری فراصوتی
preferred label: anodic cleaning @en
type: Concept

تمیزکاری فراصوتی
preferred label: ultrasonic cleaning @en
type: Concept
narrower: تمیزکاری آندی