خوردگی دوفلزی
preferred label: bimetallic corrosion @en
type: Concept
narrower: خوردگی در خاک‌های نامشابه

خوردگی در خاک‌های نامشابه
scope note: نوعی خوردگی دوفلزی که در لوله‌های مدفون در زمین به دلیل اختلاف در pH و اندازه و دانه‌بندی و ترکیبات شیمیایی نوع خاک ایجاد می‌شود.
broader: خوردگی دوفلزی
preferred label: dissimilar soil corrosion @en
type: Concept