خوردگی الکتروشیمیایی
preferred label: electrochemical corrosion @en
type: Concept
narrower: خوردگی در خاک

خوردگی در خاک
scope note: نوعی خوردگی الکتروشیمیایی که به‌ دلیل اختلاف غلظت اکسیژن و همچنین رطوبت و نمک موجود در خاک اتفاق میافتد.
broader: خوردگی الکتروشیمیایی
preferred label: soil corrosion @en
type: Concept