خوردگی تورقی
scope note: نوعی خوردگی موضعی که در زیر سطح و در مناطقی موازی با سطح اتفاق می‌افتد و در نتیجۀ آن فلز خورده‌شده به‌صورت لایه‌های نازک ظاهر می‌شود.
broader: خوردگی
preferred label: exfoliation corrosion @en
type: Concept

خوردگی
preferred label: corrosion @en
type: Concept
narrower: خوردگی تورقی