filiform corrosion
preferred label: خوردگی رشته‌ای @fa
type: Concept
narrower: underfilm corrosion

underfilm corrosion
scope note: نوعی خوردگی رشته‌ای که در گوشه‌ها و لبه‌های جسم و در زیر پوشش‌ها و سایر فیلم‌های (film) آلی ایجاد می‌شود.
broader: filiform corrosion
preferred label: خوردگی زیرپوششی @fa
type: Concept