خوردگی
preferred label: corrosion @en
type: Concept
narrower: خوردگی داغ

خوردگی داغ
scope note: خوردگی فلز در نتیجۀ تأثیر مشترک اکسایش و واکنش با ترکیبات گوگردی یا سایر آلودگی‌ها، از قبیل کلریدها، که باعث ایجاد نمک مذاب بر روی سطح فلز می‌شود.
broader: خوردگی
preferred label: hot corrosion @en
type: Concept