خوردگی درونی
scope note: نوعی خوردگی که در جدارۀ داخلی لوله و در تماس سیال عبوری با لوله رخ می‌دهد.
broader: خوردگی
preferred label: internal corrosion @en
type: Concept

خوردگی
preferred label: corrosion @en
type: Concept
narrower: خوردگی درونی