خوردگی دریایی
scope note: خوردگی تجهیزات و سازه‌های فلزی و بتنی در دریا و مناطق ساحلی
broader: خوردگی
preferred label: marine corrosion @en
type: Concept

خوردگی
preferred label: corrosion @en
type: Concept
narrower: خوردگی دریایی