خوردگی تابشی
scope note: خوردگی فلز براثر تابش شدید ذراتی همچون نوترون یا دیگر ذرات پُرانرژی
broader: خوردگی
preferred label: radiation corrosion @en
type: Concept

خوردگی
preferred label: corrosion @en
type: Concept
narrower: خوردگی تابشی