خوردگی تورمی
preferred label: swelling corrosion @en
type: Concept
narrower: خوردگی محلولی

خوردگی محلولی
scope note: نوعی خوردگی تورمی که مواد حاصل از آن به‌راحتی حل می‌شود.
broader: خوردگی تورمی
preferred label: solution corrosion @en
type: Concept