خودهمپارش
alternative label: همپارش جای‌گشتی
scope note: نوعی بازآرایی مولکولی که در آن محصول اصلی بدون نشانه‌گذاری ایزوتوپی از واکنش‌دهندۀ اصلی قابل تشخیص نیست.
broader: همپارش
preferred label: automerization @en
type: Concept

همپارش
preferred label: isomerization @en
type: Concept
narrower: خودهمپارش