بسپارش
preferred label: polymerization @en
type: Concept
narrower: بسپارش تراکمی

بسپارش تراکمی
scope note: نوعی بسپارش که در جریان آن، در هنگام تلفیق تکپارها برای شکل‌گیری بسپار موادی ساده، مانند آب و آمونیاک و هیدروکلریک‌اسید و کربن‌دی‌اکسید، حذف می‌شود.
broader: بسپارش
preferred label: condenzation polymerization @en
type: Concept