بسپارش
preferred label: polymerization @en
type: Concept
narrower: بسپارش یونی

بسپارش یونی
scope note: نوعی فرایند بسپارش که در آن یون‌ها مراکز فعال درحال‌رشد هستند.
broader: بسپارش
preferred label: ionic polymerization @en
type: Concept