واپیچش نقشه
alternative label: دگرشکلی نقشه
scope note: تغییر شکل عوارض بر روی بیضوی که براثر ترسیم آنها بر روی سطح دوبعدی ایجاد میشود.
broader: نقشه‌نگاری
preferred label: map distortion @en
type: Concept

نقشه‌نگاری
preferred label: cartography @en
type: Concept
narrower: واپیچش نقشه