بازنگری نقشه
scope note: فرایند ایجاد تغییراتی در نقشۀ موجود برای افزایش درستی آن
broader: نقشه‌نگاری
preferred label: map revision @en
type: Concept

نقشه‌نگاری
preferred label: cartography @en
type: Concept
narrower: بازنگری نقشه