ترمز خودکار
scope note: ترمزی که چنانچه لولۀ آن قطع شود، به‌صورت خودکار عمل می‌کند.
broader: ترمز
preferred label: automatic brake @en
type: Concept

ترمز
preferred label: brake @en
type: Concept
narrower: ترمز خودکار