ترمز برقی‌روغنی
scope note: سامانۀ ترمز هیدرولیکی (hydraulic) که با فشار روغن کار می‌کند و با فرمان الکتریکی هدایت می‌شود.
broader: ترمز
preferred label: electro-hydraulic brake @en
type: Concept

ترمز
preferred label: brake @en
type: Concept
narrower: ترمز برقی‌روغنی