ترمز برقی‌بادی
scope note: سامانۀ ترمزی که با شیر برقی (electrical brake solenoid valve) مهار می‌شود.
broader: ترمز
preferred label: electro-pneumatic brake @en
type: Concept

ترمز
preferred label: brake @en
type: Concept
narrower: ترمز برقی‌بادی