مسئله مقدار مرزی
preferred label: boundary-value problem @en
type: Concept
narrower: مسئله مقدار آغازی

مسئله مقدار آغازی
scope note: مسئلۀ یافتن جوابی از یک معادلۀ دیفرانسیل که در نقطه‌ای مفروض در برخی شرایط صدق کند.
broader: مسئله مقدار مرزی
preferred label: initial value problem @en
type: Concept